ip_address,name,as_number,as_org,country_code,city,version,error,dnssec,reliability,checked_at,created_at
190.151.20.148,reporte.atentus.com.,6471,ENTEL CHILE S.A.,CL,Nunoa,,,false,0.84,2021-05-03T22:25:36Z,2021-02-07T15:03:06Z
190.196.58.194,,14259,Gtd Internet S.A.,CL,Santiago,Microsoft DNS 6.1.7601 (1DB14556),,false,0.63,2021-11-29T07:34:38Z,2021-09-25T21:29:16Z
200.113.10.155,200-113-10-155.static.tie.cl.,15311,Telefonica Empresas,CL,Buin,,,false,0.85,2021-10-08T08:01:03Z,2021-09-25T21:38:09Z
201.238.224.203,sending.cl.,14259,Gtd Internet S.A.,CL,Buin,,,false,0.99,2021-10-05T22:02:57Z,2021-09-25T21:45:35Z
200.54.22.74,,16629,CTC. CORP S.A. TELEFONICA EMPRESAS,CL,Concepción,,,false,0.34,2021-10-08T08:03:56Z,2021-09-26T07:00:20Z
201.238.242.38,static.201.238.242.38.gtdinternet.com.,14259,Gtd Internet S.A.,CL,Santiago,,,false,0.88,2021-09-30T19:02:03Z,2021-09-28T11:12:11Z
190.96.61.146,,14259,Gtd Internet S.A.,CL,Colina,dnsmasq-pi-hole-2.81,,false,1.00,2021-10-01T23:21:39Z,2021-10-01T23:21:39Z
186.64.123.114,,52368,ZAM LTDA.,CL,Curicó,dnsmasq-pi-hole-2.85,,false,1.00,2021-10-01T23:51:46Z,2021-10-01T23:51:46Z
200.54.18.150,,16629,CTC. CORP S.A. TELEFONICA EMPRESAS,CL,Codegua,dnsmasq-pi-hole-2.85,,false,1.00,2021-10-02T00:19:50Z,2021-10-02T00:19:50Z
190.114.255.115,karman.ie.,52368,ZAM LTDA.,CL,Curicó,dnsmasq-pi-hole-2.86,,false,1.00,2021-10-02T16:18:41Z,2021-10-02T16:18:41Z
201.238.239.73,static.201.238.239.73.gtdinternet.com.,14259,Gtd Internet S.A.,CL,Santiago,dnsmasq-pi-hole-2.87test3,,false,1.00,2021-11-09T21:19:41Z,2021-10-02T17:24:29Z
201.236.54.164,201-236-54-164.static.tie.cl.,15311,Telefonica Empresas,CL,Nunoa,dnsmasq-pi-hole-2.85,,false,1.00,2021-10-02T17:51:14Z,2021-10-02T17:51:14Z
200.27.18.138,,6429,Telmex Chile Internet S.A.,CL,Providencia,,,false,1.00,2021-10-03T13:11:07Z,2021-10-03T13:11:07Z
200.54.194.12,200-54-194-12.static.tie.cl.,15311,Telefonica Empresas,CL,Recoleta,,,false,0.64,2021-10-08T08:02:18Z,2021-10-05T16:24:30Z
186.103.224.226,186-103-224-226.static.tie.cl.,15311,Telefonica Empresas,CL,La Reina,,,false,1.00,2021-10-06T01:54:51Z,2021-10-06T01:54:51Z
200.73.208.62,,27979,Stel Chile S.A.,CL,Santiago,,,false,1.00,2021-10-07T13:30:26Z,2021-10-07T13:30:26Z
164.77.131.172,,27651,ENTEL CHILE S.A.,CL,Providencia,,,false,1.00,2021-10-29T13:08:02Z,2021-10-29T12:45:52Z
216.155.89.66,,14117,Telefonica del Sur S.A.,CL,Port Montt,,,false,1.00,2021-11-09T20:23:27Z,2021-10-29T12:55:09Z
200.12.130.66,,10753,LUMEN-LEGACY-L3-CUSTOMER-SHARED-USE,CL,Nunoa,,,false,1.00,2022-08-07T01:02:00Z,2022-08-07T01:02:00Z
204.199.128.106,204-199-128-106.dia.static.centurylink.com.cl.,3549,LVLT-3549,CL,Santiago,,,false,1.00,2022-08-07T01:08:13Z,2022-08-07T01:08:13Z
204.199.128.122,204-199-128-122.dia.static.centurylink.com.cl.,3549,LVLT-3549,CL,Santiago,,,false,1.00,2022-08-07T01:08:15Z,2022-08-07T01:08:15Z
204.199.128.123,204-199-128-123.dia.static.centurylink.com.cl.,3549,LVLT-3549,CL,Santiago,,,false,1.00,2022-08-07T01:08:17Z,2022-08-07T01:08:17Z
204.199.128.124,204-199-128-124.dia.static.centurylink.com.cl.,3549,LVLT-3549,CL,Santiago,,,false,1.00,2022-08-07T01:08:19Z,2022-08-07T01:08:19Z
204.199.128.125,204-199-128-125.dia.static.centurylink.com.cl.,3549,LVLT-3549,CL,Santiago,,,false,1.00,2022-08-07T01:08:21Z,2022-08-07T01:08:21Z
204.199.129.38,204-199-129-38.dia.static.centurylink.com.cl.,3549,LVLT-3549,CL,Puente Alto,,,false,1.00,2022-08-07T01:08:23Z,2022-08-07T01:08:23Z
204.199.130.156,204-199-130-156.dia.static.centurylink.com.cl.,3549,LVLT-3549,CL,Santiago,,,false,1.00,2022-08-07T01:08:25Z,2022-08-07T01:08:25Z
204.199.130.162,204-199-130-162.dia.static.centurylink.com.cl.,3549,LVLT-3549,CL,Santiago,,,false,1.00,2022-08-07T01:08:27Z,2022-08-07T01:08:27Z
204.199.130.186,204-199-130-186.dia.static.centurylink.com.cl.,3549,LVLT-3549,CL,Santiago,,,false,1.00,2022-08-07T01:08:29Z,2022-08-07T01:08:29Z
204.199.130.91,204-199-130-91.dia.static.centurylink.com.cl.,3549,LVLT-3549,CL,Santiago,,,false,1.00,2022-08-07T01:08:31Z,2022-08-07T01:08:31Z
204.199.130.93,204-199-130-93.dia.static.centurylink.com.cl.,3549,LVLT-3549,CL,Santiago,,,false,1.00,2022-08-07T01:08:32Z,2022-08-07T01:08:32Z
8.242.200.150,host-8-242-200-150.centurylink.cl.,3549,LVLT-3549,CL,Santa Cruz,,,false,1.00,2022-08-07T01:44:07Z,2022-08-07T01:44:07Z
8.242.200.162,host-8-242-200-162.centurylink.cl.,3549,LVLT-3549,CL,Santa Cruz,,,false,1.00,2022-08-07T01:44:10Z,2022-08-07T01:44:10Z
8.242.200.163,host-8-242-200-163.centurylink.cl.,3549,LVLT-3549,CL,Santa Cruz,,,false,1.00,2022-08-07T01:44:12Z,2022-08-07T01:44:12Z
8.242.200.165,host-8-242-200-165.centurylink.cl.,3549,LVLT-3549,CL,Santa Cruz,,,false,1.00,2022-08-07T01:44:14Z,2022-08-07T01:44:14Z
8.242.200.166,host-8-242-200-166.centurylink.cl.,3549,LVLT-3549,CL,Santa Cruz,,,false,1.00,2022-08-07T01:44:15Z,2022-08-07T01:44:15Z
8.242.205.35,host-8-242-205-35.centurylink.cl.,3549,LVLT-3549,CL,Santa Cruz,,,false,1.00,2022-08-07T01:44:19Z,2022-08-07T01:44:19Z
190.13.179.173,,14117,Telefonica del Sur S.A.,CL,Los Ángeles,,,false,1.00,2023-02-15T21:12:44Z,2022-09-29T14:44:36Z
179.56.194.41,,262182,Media Networks Latin America SAC,CL,Port Montt,,,false,1.00,2022-10-01T23:36:11Z,2022-10-01T12:21:56Z
190.171.153.133,190-171-153-133.empresas.movistar.cl.,16629,CTC. CORP S.A. TELEFONICA EMPRESAS,CL,Santiago,,,false,1.00,2022-10-03T15:39:55Z,2022-10-03T15:12:17Z
190.208.16.226,190.208.16.226.,6429,Telmex Chile Internet S.A.,CL,San Pedro de la Paz,,,false,1.00,2022-10-04T01:58:23Z,2022-10-04T01:58:23Z
186.103.167.190,186-103-167-190.static.tie.cl.,15311,Telefonica Empresas,CL,La Serena,dnsmasq-2.40,,true,1.00,2022-10-04T13:57:50Z,2022-10-04T13:57:50Z
170.82.130.200,ip130.200.cloud.vzion.net.,10778,MCL Internet,CL,,9.8.2rc1-RedHat-9.8.2-0.68.rc1.el6_10.1,,true,1.00,2023-02-08T23:51:00Z,2022-10-12T09:17:43Z
181.212.129.202,181-212-129-202.baf.movistar.cl.,16629,CTC. CORP S.A. TELEFONICA EMPRESAS,CL,,,,false,1.00,2022-10-12T16:51:12Z,2022-10-12T16:51:12Z
190.153.173.190,reverso.190.173.153.190.static.operaciones.gtdinternet.com.,14259,Gtd Internet S.A.,CL,Santiago,,,false,1.00,2022-10-14T05:35:42Z,2022-10-13T21:28:56Z
128.201.117.206,,265743,COMERCIAL WASHINGTON ERNESTO OYARCE SAZO E.I.R.L. SENALMAX,CL,Molina,,,false,1.00,2022-10-17T22:36:12Z,2022-10-17T21:52:33Z
201.159.170.194,grubi.vhn.cl.,262256,Servicios Informaticos Hostname Ltda,CL,Santiago,9.11.4-P2-RedHat-9.11.4-26.P2.el7_9.9,,true,0.99,2022-10-28T09:32:02Z,2022-10-18T01:16:58Z
190.151.10.179,,27651,ENTEL CHILE S.A.,CL,Arica,,,false,1.00,2022-10-19T21:10:26Z,2022-10-19T21:10:26Z
190.121.4.63,,14117,Telefonica del Sur S.A.,CL,San Miguel,,,false,0.92,2022-10-26T08:32:07Z,2022-10-22T16:27:49Z
186.10.6.226,b6226.entelchile.net.,27651,ENTEL CHILE S.A.,CL,Santiago,,,false,1.00,2023-02-08T23:57:53Z,2022-10-22T17:09:50Z
186.190.236.11,,52313,Luz Linares S.A.,CL,Linares,,,false,0.87,2022-11-14T20:35:17Z,2022-10-23T21:54:30Z
190.151.47.137,,27651,ENTEL CHILE S.A.,CL,Constitucion,,,false,1.00,2022-10-25T01:37:25Z,2022-10-25T01:37:25Z
152.230.112.34,static.152.230.112.34.gtdinternet.com.,14259,Gtd Internet S.A.,CL,Santiago,,,false,0.87,2023-03-01T22:46:37Z,2022-10-25T16:20:03Z
190.163.174.144,pc-144-174-163-190.cm.vtr.net.,22047,VTR BANDA ANCHA S.A.,CL,Santiago,,,false,1.00,2022-10-26T00:24:39Z,2022-10-26T00:24:39Z
200.63.97.15,srv15.hostingnic.cl.,265831,SOC. COMERCIAL WIRENET CHILE LTDA.,CL,,Microsoft DNS 6.1.7601 (1DB15F75),,false,1.00,2022-11-11T00:58:40Z,2022-11-04T11:42:35Z
181.212.113.146,181-212-113-146.baf.movistar.cl.,16629,CTC. CORP S.A. TELEFONICA EMPRESAS,CL,Los Andes,dnsmasq-2.84rc2,,false,0.98,2022-11-14T14:41:35Z,2022-11-06T14:33:12Z
138.219.229.130,host229-130.linets.cl.,263826,LINETS CHILE SPA,CL,,dnsmasq-2.66,,false,0.92,2022-11-11T01:02:43Z,2022-11-10T01:25:49Z
45.160.15.254,,266870,SERVICIO DE TELECOMUNICACIONES VEMOS MAS LTDA.,CL,Lampa,,,false,0.97,2022-11-17T03:43:49Z,2022-11-10T07:47:28Z
190.102.250.136,host190.102.250.136.dynamic.pacificonet.cl.,27901,Pacifico Cable SPA.,CL,,,,false,0.62,2022-11-14T01:45:18Z,2022-11-12T10:14:24Z
152.230.113.98,static.152.230.113.98.gtdinternet.com.,14259,Gtd Internet S.A.,CL,Santiago,,,false,0.33,2022-11-13T16:41:29Z,2022-11-13T06:56:20Z
186.67.175.122,,27651,ENTEL CHILE S.A.,CL,Iquique,,,false,1.00,2022-11-14T04:34:45Z,2022-11-14T04:34:45Z
200.73.84.43,host43.200.73.84.static.ifxnw.cl.,18747,IFX18747,CL,Santiago,dnsmasq-2.78,,false,0.99,2023-02-27T23:49:08Z,2022-11-16T01:34:14Z
186.64.123.78,sindelen.cl.,52368,ZAM LTDA.,CL,Curicó,,,false,0.98,2022-12-06T22:01:10Z,2022-11-16T09:26:26Z
186.67.152.108,,27651,ENTEL CHILE S.A.,CL,,,,false,1.00,2022-12-06T22:04:05Z,2022-11-19T20:52:46Z
186.10.127.210,z408.entelchile.net.,27651,ENTEL CHILE S.A.,CL,Panguipulli,,,false,0.99,2022-12-06T22:04:14Z,2022-11-19T23:26:23Z
138.0.120.199,,272014,DCH COMPANIA DE COMUNICACIONES E INMOBILIARIA LTDA,CL,,,,false,1.00,2023-02-15T15:51:05Z,2022-11-21T17:02:51Z
200.73.251.98,pc-98-251-73-200.cm.vtr.net.,22047,VTR BANDA ANCHA S.A.,CL,Valdivia,,,false,0.96,2022-12-06T23:48:56Z,2022-11-22T20:24:59Z
200.2.116.245,,11340,Red Universitaria Nacional,CL,Valdivia,,,false,1.00,2023-02-25T21:02:16Z,2022-11-27T03:32:23Z
190.96.94.98,sinapsis.colinaeduca.cl.,14259,Gtd Internet S.A.,CL,Santiago,,,false,0.99,2023-02-27T16:49:59Z,2022-11-30T16:11:52Z
201.219.154.75,ppp75.dsl.netline.cl.,20015,FullCom S.A.,CL,San Bernardo,Microsoft DNS 6.1.7601 (1DB15F75),,false,1.00,2022-12-06T23:55:08Z,2022-11-30T16:50:30Z
190.151.34.62,,27651,ENTEL CHILE S.A.,CL,Santiago,dnsmasq-2.52,,false,1.00,2023-02-09T00:29:28Z,2022-12-03T01:49:33Z
177.221.140.21,host-21-140-221-177.scl.grupocg.cl.,270014,GRUPO CG LIMITADA,CL,Santiago,,,false,1.00,2023-02-18T18:11:43Z,2022-12-07T20:43:04Z
186.103.133.91,186-103-133-91.static.tie.cl.,15311,Telefonica Empresas,CL,Santiago,,,false,0.87,2023-02-19T19:53:40Z,2022-12-08T04:20:36Z
45.7.229.188,formateq.cl.,52512,OPENCLOUD SpA,CL,,dnsmasq-2.79,,false,0.99,2023-02-19T13:06:52Z,2022-12-08T17:52:45Z
190.96.93.74,,14259,Gtd Internet S.A.,CL,Santiago,,,false,1.00,2023-02-15T15:52:06Z,2022-12-09T15:50:26Z
45.7.228.232,NEG.CAPRICORN.CL.,52512,OPENCLOUD SpA,CL,,,,false,1.00,2023-02-17T05:15:02Z,2022-12-15T18:44:17Z
186.103.175.74,186-103-175-74.static.tie.cl.,15311,Telefonica Empresas,CL,Quilpué,,,false,0.86,2023-02-17T05:15:36Z,2022-12-16T19:32:40Z
186.67.45.139,,27651,ENTEL CHILE S.A.,CL,Rancagua,dnsmasq-2.40,,true,0.94,2023-02-19T06:55:11Z,2022-12-26T07:13:40Z
200.54.225.86,,16629,CTC. CORP S.A. TELEFONICA EMPRESAS,CL,Santiago,,,false,0.79,2023-02-19T07:59:51Z,2022-12-30T18:42:53Z
190.211.250.218,,271836,Compania de Comunicaciones Coyhaique Ltda.,CL,Rio Bueno,,,false,0.91,2023-02-27T16:53:05Z,2023-02-19T11:33:16Z
45.225.95.171,,263702,GRUPO ZGH SPA,CL,Santiago,,,false,0.88,2023-02-26T09:07:33Z,2023-02-20T17:26:42Z
200.113.61.170,200-113-61-170.static.tie.cl.,16629,CTC. CORP S.A. TELEFONICA EMPRESAS,CL,La Union,,,false,0.94,2023-02-26T09:08:14Z,2023-02-21T11:54:38Z
190.82.70.214,190-82-70-214.static.tie.cl.,15311,Telefonica Empresas,CL,San Felipe,,,false,0.90,2023-02-27T16:58:40Z,2023-02-24T15:44:32Z
152.230.47.28,static.152.230.47.28.gtdinternet.com.,14259,Gtd Internet S.A.,CL,Santiago,,,false,0.85,2023-02-28T05:51:26Z,2023-02-25T04:27:48Z
181.212.15.98,181-212-15-98.baf.movistar.cl.,16629,CTC. CORP S.A. TELEFONICA EMPRESAS,CL,Melipilla,,,false,0.80,2023-02-27T16:59:17Z,2023-02-25T09:39:25Z
152.231.93.186,,27651,ENTEL CHILE S.A.,CL,Santiago,,,false,0.99,2023-03-04T03:57:37Z,2023-02-26T10:22:21Z
186.64.123.31,cl.zzls.xyz.,52368,ZAM LTDA.,CL,,9.18.9,,false,1.00,2023-02-28T07:58:39Z,2023-02-27T04:29:28Z
186.103.181.254,186-103-181-254.static.tie.cl.,15311,Telefonica Empresas,CL,Santiago,,,false,1.00,2023-02-28T14:53:52Z,2023-02-27T12:28:11Z
186.103.224.37,186-103-224-37.static.tie.cl.,15311,Telefonica Empresas,CL,Santiago,,,false,0.91,2023-03-01T22:45:28Z,2023-02-28T09:03:18Z
45.160.13.9,,266870,SERVICIO DE TELECOMUNICACIONES VEMOS MAS LTDA.,CL,Santiago,,,true,1.00,2023-02-28T18:48:26Z,2023-02-28T09:13:11Z
190.151.20.146,cluster-1.atentus.com.,27651,ENTEL CHILE S.A.,CL,Santiago,,,false,0.94,2023-03-02T05:50:14Z,2023-02-28T19:18:34Z
200.42.174.188,andesfoods.com.,15311,Telefonica Empresas,CL,Santiago,,,false,1.00,2023-03-01T22:48:41Z,2023-02-28T19:24:34Z
200.54.146.103,webmail.cambiaso.cl.,15311,Telefonica Empresas,CL,Santiago,,,false,0.97,2023-03-05T08:49:02Z,2023-02-28T19:24:40Z
200.68.46.21,famae.cl.,16629,CTC. CORP S.A. TELEFONICA EMPRESAS,CL,Chimbarongo,,,false,1.00,2023-03-01T22:49:59Z,2023-02-28T19:25:05Z
190.102.241.12,host190.102.241.12.dynamic.pacificored.cl.,27901,Pacifico Cable SPA.,CL,Concepción,unbound 1.17.0,,true,0.95,2023-03-03T07:51:31Z,2023-03-03T00:04:25Z
190.217.155.118,,14117,Telefonica del Sur S.A.,CL,Port Montt,,,false,0.93,2023-03-04T00:49:28Z,2023-03-03T11:25:06Z
45.165.171.82,,267717,CS SPA,CL,Santiago,dnsmasq-2.85,,false,1.00,2023-03-05T18:54:32Z,2023-03-05T18:54:32Z
186.10.112.158,z356.entelchile.net.,27651,ENTEL CHILE S.A.,CL,Las Condes,,,false,0.94,2023-03-08T17:48:57Z,2023-03-05T23:51:29Z
181.212.39.92,181-212-39-92.baf.movistar.cl.,16629,CTC. CORP S.A. TELEFONICA EMPRESAS,CL,Cerro Navia,,,false,1.00,2023-03-10T02:52:34Z,2023-03-09T17:24:47Z
201.236.189.222,,15311,Telefonica Empresas,CL,Iquique,,,false,1.00,2023-03-10T04:45:07Z,2023-03-10T03:10:41Z
200.54.9.138,,16629,CTC. CORP S.A. TELEFONICA EMPRESAS,CL,Santiago,,,false,1.00,2023-04-20T15:47:59Z,2023-03-11T05:17:19Z
146.155.226.12,ADN.bio.puc.cl.,20191,Pontificia Universidad Catolica de Chile,CL,Santiago,,,false,1.00,2023-03-13T04:45:02Z,2023-03-12T07:55:35Z
186.103.198.186,186-103-198-186.static.tie.cl.,15311,Telefonica Empresas,CL,Santiago,,,false,0.94,2023-04-12T12:10:57Z,2023-03-13T00:52:40Z
186.103.201.77,186-103-201-77.static.tie.cl.,15311,Telefonica Empresas,CL,La Calera,,,false,1.00,2023-03-13T04:45:32Z,2023-03-13T02:28:25Z
201.221.192.102,,14117,Telefonica del Sur S.A.,CL,Valparaíso,,,false,1.00,2023-03-13T03:36:22Z,2023-03-13T03:36:22Z
190.114.253.110,wolf.lightx.com.,52368,ZAM LTDA.,CL,,,,false,1.00,2023-03-13T07:46:07Z,2023-03-13T04:51:16Z
201.148.106.124,dns2-out.nethelp.cl.,265839,HOSTING.,CL,Santiago,,,false,0.86,2023-03-13T07:46:12Z,2023-03-13T04:57:46Z
138.255.103.162,host-162-103-255-138.static.zglobalhost.com.,263702,GRUPO ZGH SPA,CL,La Florida,,,false,1.00,2023-03-13T06:37:12Z,2023-03-13T06:37:12Z
190.46.221.114,pc-114-221-46-190.cm.vtr.net.,22047,VTR BANDA ANCHA S.A.,CL,Santiago,,,false,1.00,2023-03-13T07:19:23Z,2023-03-13T07:19:23Z
200.54.214.235,,16629,CTC. CORP S.A. TELEFONICA EMPRESAS,CL,Viña del Mar,,,false,1.00,2023-03-13T07:37:15Z,2023-03-13T07:37:15Z
190.110.164.194,host190.110.164.194.dynamic.pacificonet.cl.,27901,Pacifico Cable SPA.,CL,Valparaíso,,,false,1.00,2023-03-13T07:38:18Z,2023-03-13T07:38:18Z
181.212.87.227,181-212-87-227.baf.movistar.cl.,16629,CTC. CORP S.A. TELEFONICA EMPRESAS,CL,San Fernando,,,false,1.00,2023-03-14T17:45:24Z,2023-03-13T09:01:56Z
8.242.205.38,host-8-242-205-38.centurylink.cl.,3549,LVLT-3549,CL,Santiago,,,false,1.00,2023-03-13T14:45:52Z,2023-03-13T09:21:05Z
181.226.233.122,,14117,Telefonica del Sur S.A.,CL,Angol,,,false,1.00,2023-03-14T17:45:43Z,2023-03-13T09:32:01Z
152.231.66.204,,27651,ENTEL CHILE S.A.,CL,Temuco,,,false,1.00,2023-03-13T12:39:37Z,2023-03-13T12:39:37Z
45.7.231.33,,52512,OPENCLOUD SpA,CL,,9.11.4-P2-RedHat-9.11.4-26.P2.el7_9.9,,false,1.00,2023-03-13T13:59:11Z,2023-03-13T13:59:11Z
181.212.15.107,181-212-15-107.baf.movistar.cl.,16629,CTC. CORP S.A. TELEFONICA EMPRESAS,CL,Melipilla,,,false,1.00,2023-03-13T14:01:45Z,2023-03-13T14:01:45Z
45.160.189.163,,266887,SOCIEDAD GAMACON LIMITADA,CL,Chimbarongo,,,false,1.00,2023-03-13T14:08:32Z,2023-03-13T14:08:32Z
200.111.8.178,,27651,ENTEL CHILE S.A.,CL,Santiago,,,false,1.00,2023-03-13T14:14:12Z,2023-03-13T14:14:12Z
200.54.51.6,,16629,CTC. CORP S.A. TELEFONICA EMPRESAS,CL,Santiago,,,false,1.00,2023-03-13T14:25:20Z,2023-03-13T14:25:20Z
131.0.172.68,,14117,Telefonica del Sur S.A.,CL,,,,false,1.00,2023-03-13T14:45:02Z,2023-03-13T14:45:02Z
186.65.72.88,,16471,Adexus S.A.,CL,,,,false,1.00,2023-03-18T02:45:08Z,2023-03-13T16:06:40Z
190.151.78.115,,27651,ENTEL CHILE S.A.,CL,Santiago,,,false,1.00,2023-03-15T09:49:11Z,2023-03-13T17:37:04Z
181.212.48.42,181-212-48-42.baf.movistar.cl.,16629,CTC. CORP S.A. TELEFONICA EMPRESAS,CL,Santiago,,,false,1.00,2023-03-15T09:49:24Z,2023-03-13T17:54:42Z
190.46.63.248,pc-248-63-46-190.cm.vtr.net.,22047,VTR BANDA ANCHA S.A.,CL,Arica,,,false,1.00,2023-03-15T09:49:54Z,2023-03-13T18:38:27Z
200.91.28.35,mail.marco.cl.,13424,Intercity,CL,Santiago,dnsmasq-2.83,,false,1.00,2023-03-15T09:49:54Z,2023-03-13T18:40:39Z
200.111.47.43,,27651,ENTEL CHILE S.A.,CL,Arica,,,false,1.00,2023-03-15T09:51:16Z,2023-03-13T20:43:32Z
45.228.211.238,,263702,GRUPO ZGH SPA,CL,Quinta Normal,,,false,1.00,2023-03-15T09:51:34Z,2023-03-13T21:08:45Z
200.111.106.126,,27651,ENTEL CHILE S.A.,CL,Macul,,,false,1.00,2023-03-15T09:51:33Z,2023-03-13T21:09:47Z
200.29.133.200,,6429,Telmex Chile Internet S.A.,CL,Santiago,,,false,1.00,2023-03-15T09:51:39Z,2023-03-13T21:18:35Z
181.118.167.110,181-118-167-110.emp.movistar.cl.,23416,Telefonica Data Chile S.A.,CL,Santiago,,,false,1.00,2023-03-15T09:52:16Z,2023-03-13T22:12:31Z
190.45.106.63,pc-63-106-45-190.cm.vtr.net.,22047,VTR BANDA ANCHA S.A.,CL,Arica,,,false,1.00,2023-03-15T09:52:25Z,2023-03-13T22:27:36Z
152.230.64.24,static.152.230.64.24.gtdinternet.com.,14259,Gtd Internet S.A.,CL,General Lagos,,,false,1.00,2023-03-15T09:53:44Z,2023-03-14T00:26:48Z
189.126.8.226,226-8-126-189.telefonicadelpacifico.cl.,269956,HABLAIP SPA,CL,Santiago,,,false,1.00,2023-03-15T09:53:53Z,2023-03-14T00:44:57Z
201.219.136.42,ppp-42-136-219-201.adsl.netline.cl.,20015,FullCom S.A.,CL,Santiago,,,false,1.00,2023-03-15T09:54:03Z,2023-03-14T00:57:21Z
179.56.125.105,,14117,Telefonica del Sur S.A.,CL,Llanquihue,,,false,0.89,2023-04-19T01:18:42Z,2023-03-14T01:10:19Z
200.27.71.227,,6429,Telmex Chile Internet S.A.,CL,Santiago,9.9.4-RedHat-9.9.4-61.el7,,true,0.95,2023-04-20T15:51:53Z,2023-03-14T01:22:39Z
186.10.15.156,b15156.entelchile.net.,27651,ENTEL CHILE S.A.,CL,Santiago,,,false,1.00,2023-03-15T09:54:55Z,2023-03-14T02:19:58Z
45.65.240.107,Cliente.HomeNet.Villarrica.,264780,HomeNet LTDA,CL,Villarrica,dnsmasq-2.45,,true,1.00,2023-03-15T09:54:58Z,2023-03-14T02:27:02Z
200.73.113.158,servidor.tjconsultores.cl.,263237,PowerHost Telecom SPA,CL,Santiago,,,false,1.00,2023-03-14T03:13:12Z,2023-03-14T03:13:12Z
201.187.41.107,,14117,Telefonica del Sur S.A.,CL,Pucon,,,false,1.00,2023-03-14T03:45:00Z,2023-03-14T03:45:00Z
45.236.128.107,www.cobratuchoque.cl.,64111,INFORMATICA BLUEHOSTING LIMITADA,CL,,,,false,1.00,2023-03-14T05:51:41Z,2023-03-14T03:59:48Z
186.64.123.203,neodigital.cl.,52368,ZAM LTDA.,CL,,,,false,1.00,2023-03-14T04:53:36Z,2023-03-14T04:53:36Z
200.27.155.58,,6429,Telmex Chile Internet S.A.,CL,Santiago,,,false,1.00,2023-03-14T05:36:53Z,2023-03-14T05:36:53Z
186.148.33.107,186-148-33-107.static.mundo.movistar.cl.,7004,CTC Transmisiones Regionales S.A.,CL,Isla de Maipo,,,false,1.00,2023-03-14T06:11:10Z,2023-03-14T06:11:10Z
190.4.209.58,190-4-209-58.bam.movistar.cl.,16629,CTC. CORP S.A. TELEFONICA EMPRESAS,CL,Santiago,,,false,1.00,2023-03-14T06:31:44Z,2023-03-14T06:31:44Z
200.27.188.155,,6429,Telmex Chile Internet S.A.,CL,Santiago,dnsmasq-2.40,,true,1.00,2023-03-14T18:46:27Z,2023-03-14T07:23:43Z
201.236.145.10,,15311,Telefonica Empresas,CL,Hualqui,,,false,1.00,2023-03-15T04:47:55Z,2023-03-14T08:39:29Z
190.151.76.90,,27651,ENTEL CHILE S.A.,CL,Santiago,9.11.4-P2-RedHat-9.11.4-26.P2.el7_9.4,,true,1.00,2023-03-15T04:47:56Z,2023-03-14T08:40:16Z
186.67.224.156,,27651,ENTEL CHILE S.A.,CL,Santiago,,,false,1.00,2023-03-15T04:48:35Z,2023-03-14T09:46:08Z
190.13.146.123,,14117,Telefonica del Sur S.A.,CL,Osorno,,,false,1.00,2023-04-20T15:52:05Z,2023-03-14T10:35:04Z
201.148.107.14,cloud105200.dedicados.cl.,265839,HOSTING.,CL,Santiago,,,false,1.00,2023-03-15T04:49:24Z,2023-03-14T11:03:27Z
190.215.82.157,,18822,Manquehuenet,CL,Santiago,,,false,1.00,2023-03-15T04:49:17Z,2023-03-14T11:04:06Z
190.151.104.178,,27651,ENTEL CHILE S.A.,CL,Vallenar,none,,false,1.00,2023-03-15T04:49:36Z,2023-03-14T11:37:23Z
45.225.92.197,unnamed.as263702.net.,263702,GRUPO ZGH SPA,CL,Santiago,,,false,0.76,2023-04-21T11:42:54Z,2023-03-14T13:01:45Z
181.212.56.235,181-212-56-235.baf.movistar.cl.,16629,CTC. CORP S.A. TELEFONICA EMPRESAS,CL,La Cruz,,,false,1.00,2023-03-15T04:51:16Z,2023-03-14T14:29:09Z
200.10.221.16,ns.foropermanentechile-japon.cl.,27651,ENTEL CHILE S.A.,CL,,,,false,1.00,2023-03-15T04:51:13Z,2023-03-14T14:32:45Z
190.110.97.172,190-110-97-172.cust.silicanetworks.cl.,7049,Silica Networks Argentina S.A.,CL,La Florida,,,false,1.00,2023-03-15T04:52:46Z,2023-03-14T16:55:47Z
45.160.188.171,,266887,SOCIEDAD GAMACON LIMITADA,CL,Chimbarongo,,,false,1.00,2023-03-15T04:52:59Z,2023-03-14T17:19:48Z
170.82.188.146,host170.82.188.146.dynamic.pacificonet.cl.,27901,Pacifico Cable SPA.,CL,Talagante,,,false,1.00,2023-03-15T04:53:16Z,2023-03-14T17:38:32Z
45.4.169.10,,265678,W M Servicios y Gestiones Ltda.,CL,Hualane,,,false,1.00,2023-03-15T04:53:35Z,2023-03-14T18:07:44Z
200.54.72.53,,16629,CTC. CORP S.A. TELEFONICA EMPRESAS,CL,Santiago,,,false,1.00,2023-03-15T04:53:53Z,2023-03-14T18:31:00Z
186.103.214.226,186-103-214-226.static.tie.cl.,15311,Telefonica Empresas,CL,Putaendo,,,false,1.00,2023-03-15T04:55:08Z,2023-03-14T20:40:46Z
164.77.156.235,webmail.calimec.cl.,27651,ENTEL CHILE S.A.,CL,Santiago,,,false,0.82,2023-03-26T22:07:58Z,2023-03-14T21:18:47Z
190.102.233.135,host190.102.233.135.dynamic.pacificored.cl.,27901,Pacifico Cable SPA.,CL,Santiago,,,false,0.99,2023-03-18T02:45:16Z,2023-03-14T22:02:27Z
200.54.49.179,,16629,CTC. CORP S.A. TELEFONICA EMPRESAS,CL,Santiago,,,false,1.00,2023-03-15T09:57:40Z,2023-03-14T22:12:18Z
190.110.98.11,,7049,Silica Networks Argentina S.A.,CL,San Vicente de Tagua Tagua,,,false,0.60,2023-03-15T09:58:06Z,2023-03-14T22:40:55Z
207.248.3.46,,64139,GRUPO METROWAN TELECOM SPA,CL,Requinoa,,,true,1.00,2023-03-18T02:47:12Z,2023-03-15T00:53:01Z
45.236.184.6,,266803,TIC CHILE COMUNICACIONES LIMITADA,CL,Arica,,,false,0.98,2023-04-12T18:13:57Z,2023-03-15T02:15:49Z
200.111.195.34,,27651,ENTEL CHILE S.A.,CL,Santiago,dnsmasq-2.47,,true,1.00,2023-03-18T02:49:22Z,2023-03-15T04:24:42Z
200.27.110.59,,6429,Telmex Chile Internet S.A.,CL,Santiago,,,false,1.00,2023-03-18T02:49:36Z,2023-03-15T04:48:49Z
200.54.78.66,,16629,CTC. CORP S.A. TELEFONICA EMPRESAS,CL,Santiago,,,false,1.00,2023-04-03T21:32:13Z,2023-03-15T04:57:22Z
190.96.85.254,marinetraining.cl.,265839,HOSTING.,CL,Puente Alto,,,true,1.00,2023-03-26T22:07:59Z,2023-03-15T05:10:29Z
186.67.52.221,,27651,ENTEL CHILE S.A.,CL,Santiago,,,false,1.00,2023-03-18T02:50:05Z,2023-03-15T05:38:12Z
190.6.122.41,dhcp-602ad07da9c7.602ad07da9c4.cpe.ovl.cablecolor.cl.,262213,Comsat Limitada,CL,Ovalle,,,false,1.00,2023-03-18T02:50:11Z,2023-03-15T05:45:53Z
190.163.21.166,pc-166-21-163-190.cm.vtr.net.,22047,VTR BANDA ANCHA S.A.,CL,Calama,,,false,1.00,2023-03-18T02:50:29Z,2023-03-15T06:16:06Z
207.248.3.232,,64139,GRUPO METROWAN TELECOM SPA,CL,Requinoa,,,false,1.00,2023-03-18T02:50:42Z,2023-03-15T06:37:56Z
45.238.20.140,,266830,AIRPOINT TELECOMUNICACIONES LIMITADA,CL,Melipilla,,,true,1.00,2023-03-18T02:50:49Z,2023-03-15T06:50:04Z
170.239.84.187,myapp.cl.,52368,ZAM LTDA.,CL,Curicó,,,false,0.99,2023-03-18T02:52:04Z,2023-03-15T09:03:17Z
216.241.25.83,host83.216.241.25.ifxnw.cl.,18747,IFX18747,CL,Santiago,,,false,1.00,2023-03-18T02:52:25Z,2023-03-15T09:36:06Z
186.103.142.219,186-103-142-219.static.tie.cl.,15311,Telefonica Empresas,CL,Santiago,,,false,0.99,2023-03-18T02:52:37Z,2023-03-15T09:53:05Z
200.111.199.243,,27651,ENTEL CHILE S.A.,CL,Santiago,,,false,1.00,2023-03-18T02:53:03Z,2023-03-15T10:36:35Z
190.216.145.29,,3549,LVLT-3549,CL,Santiago,,,false,1.00,2023-03-18T02:53:30Z,2023-03-15T11:20:05Z
200.54.173.94,,15311,Telefonica Empresas,CL,Santiago,,,true,0.72,2023-03-18T02:53:39Z,2023-03-15T11:27:39Z